تهدید (روان‌شناسی)
scope note: عمل، حالت یا پاسخی حاکی از قصد حمله و آسیب‌زدن یا ارعاب دیگری و یا نشانه‌ای است که خبر از ناگواری در آینده می‌دهد.
broader: خطر
preferred label: Threat (Psychology) @en
type: Concept

خطر
preferred label: Hazard @en
type: Concept
narrower: تهدید (روان‌شناسی)