Secondary hazard
scope note: Hazards occurring as a result of another hazard or disaster.
scope note: خطری که در نتیجه یک خطر دیگر روی می‌دهد، مثل آتش‌سوزی یا زمین‌‌لغزه به دنبال زلزله، کمبود مواد غذایی به دنبال خشکسالی یا سیل. @fa
broader: Hazard
preferred label: خطر ثانویه @fa
type: Concept

Hazard
preferred label: خطر @fa
type: Concept
narrower: Secondary hazard