آتش
scope note: واکنشی است شیمیایی همراه با پیدایش گرما و نور و شعله که بیشتر از سوختن تند، یعنی ترکیب شدن مواد با اکسیژن پدید می‌آید. آتش دارای دو جنبه مثبت و منفی است. همان‌طور که می‌تواند نور، روشنایی، گرما و شادی به ارمغان بیاورد (جنبه مثبت) قادر است با خشونت و بی‌رحمی همه چیز را طعمه خود کرده و نابود سازد (جنبه منفی).
related: شعله
preferred label: Fire (Concept) @en
type: Concept

شعله
preferred label: Flame @en
type: Concept
related: آتش