خشونت
scope note: کاربرد نیرو در غیر جای خود و یا بر خلاف قانون. خشونت وسیله‌‌ای است برای اعمال فشار و اجبار و با این خصیصه ممتاز می‌شود که نیاز به آلات و ادوات دارد. سازمان جهانی بهداشت، خشونت را به معنای استفاده عمدی از نیرو یا قدرت فیزیکی، ارعاب و تهدید علیه خود یا دیگری یا علیه یک گروه یا جمع می‌داند که به آسیب، مرگ، عواقب روحی، روانی، نقصان در رشد و تکامل یا محرومیت و یا احتمال وقوع چنین عوارضی منجر می‌شود. خشونت مهمترین عامل مرگ ‌و‌ میر جهانی برای افراد 15 تا 44 ساله است. در سال‌های اخیر کمتر از 10 درصد مرگ‌های ناشی از خشونت، در کشورهای با درآمد بالا به وقوع پیوسته است. در حدود نیمی از مرگ‌ها ناشی از خشونت به علت خودکشی، حدود یک سوم به علت قتل و یک پنجم به علت جنگ بوده است.
related: جرم
preferred label: Violence @en
type: Concept

جرم
preferred label: Crime @en
type: Concept
related: خشونت