آب زیرزمینی
alternative label: آب زیرسطحی
scope note: Water present below the soil surface and occupying voids in the porous subsoil. @en
scope note: آبی که بر اثر نفوذ آب‌های جاری در داخل لایه‌های زمین قرار می‌گیرد و معمولاً در قسمت‌های غیرقابل نفوذ مستقر می‌‌شود.
related: کنترل آلودگی
preferred label: Groundwater @en
type: Concept

کنترل آلودگی
preferred label: Pollution control @en
type: Concept
related: آب زیرزمینی