اینترنت
preferred label: Internet @en
type: Concept
related: اینترانت

اینترانت
alternative label: شبکه‌های رایانه‌ای درون‌سازمان
scope note: شبکه خصوصی رایانه‌ای که به دلیل شباهت آن به سایت وب جهانی و مبتنی بودن آن بر همان فناوری، اینترانت خوانده شد با این تفاوت که صرفاً درون‌سازمانی است و به اینترنت متصل نیست. اگرچه بعضی از اینترانت‌ها دستیابی به اینترنت را هم فراهم می‌کنند.
related: اینترنت
preferred label: Intranet @en
type: Concept