Vaccination
preferred label: واکسیناسیون @fa
type: Concept
related: Immunization

Immunization
scope note: Rendering a person or animal immune to certain infections by the process of injecting either antigen or a serum containing specific antibodies.
scope note: مایه‌کوبی یا دادن واکسن برای حفاظت افراد حساس در برابر بیماری قابل واگیری از طریق تجویز سوسپانسیون ارگانیسم‌های کشته (مانند سیاه‌سرفه) یا عامل بیماری‌زای زنده و تعدیل شده (مانند تب زرد) یا زهر غیرفعال شده (مانند کزاز). @fa
related: Vaccination
related: Communicable disease
preferred label: ایمن‌سازی @fa
type: Concept

Communicable disease
preferred label: بیماری واگیر @fa
type: Concept
related: Immunization