Detonation
scope note: An explosion caused by the rapid chemical reaction of a substance at sonic velocity and in association with a shock waves in which the flame front moves in excess of sonic speed.
scope note: انفجار ناشی از واکنش شیمیایی سریع مواد با سرعت صوت و همراه با امواج شدیدی که طی آن، امواج شعله‌ور به سرعتی مافوق صوت می‌رسند. @fa
related: Deflagration
related: Explosive
related: Explosion
preferred label: انفجار ضربه‌ای @fa
type: Concept

Deflagration
preferred label: گرگرفتن @fa
type: Concept
related: Detonation

Explosive
preferred label: ماده منفجره @fa
type: Concept
related: Detonation

Explosion
preferred label: انفجار @fa
type: Concept
related: Detonation