Back burn
scope note: Fires started from a prepared line or other barrier to burn an area of flammable material in the path of an advancing fire in order to control that fire.
scope note: آتشی که از خط یا مانع آماده شده دیگر آغاز می‌‌شود تا منطقه‌ای را که دارای مواد آتش‌زا است در مسیر آتش پیشرونده دیگری بسوزاند و موجب مهار آتش مزبور شود. @fa
broader: Fire control
preferred label: آتش‌سوزی احتیاطی @fa
type: Concept

Fire control
preferred label: کنترل آتش‌سوزی @fa
type: Concept
narrower: Back burn