Coordination
preferred label: هماهنگی @fa
type: Concept
related: Control

Command
preferred label: فرماندهی @fa
type: Concept
related: Control

Control
scope note: The overall direction response and recovery activities in an emergency situation.
scope note: هدایت همه جانبه واکنش‌ها در برابر فاجعه و بحران و حادثه و فعالیت‌های بهسازی و ترمیم در وضع اضطراری. کنترل، فرایندی است که از طریق آن عملیات انجام شده با فعالیت‌های برنامه‌ریزی شده مطابقت داده می‌شود. فرایند کنترل، با نظارت بر جریان امور، پیگیری عملکرد و انجام اصلاحات در سیستم سروکار دارد. در فرایند کنترل، چهار مرحله طی می‌شود: تعیین معیارها و ضوابط کنترل، مقایسه نتایج عملکردها با معیارهای تعیین شده، تشخیص میزان انحراف‌ها و بررسی علل بروز آنها و تنظیم و اجرای برنامه‌ها و عملیات اصلاحی. @fa
related: Coordination
related: Command
preferred label: کنترل @fa
type: Concept