Action
scope note: The executive command to start an operation whereby all required personnel are called to their posts to be checked.
scope note: دستور اجرایی شروع یک عملیات که به موجب آن همه افراد مورد نیاز به پایگاه‌های خود فراخوانده می‌شوند. @fa
related: Mobilization
preferred label: اقدام @fa
type: Concept

Mobilization
preferred label: بسیج @fa
type: Concept
related: Action