حکومت محلی
alternative label: دولت محلی
scope note: سازمانی که در واحدهای مانند ده، بخش، شهر، شهرستان یا استان با اختیارات وسیع به‌وجود می‌آید.
narrower: برنامه حکومت محلی برای فاجعه
preferred label: Local government @en
type: Concept

برنامه حکومت محلی برای فاجعه
preferred label: Local government disaster plan @en
type: Concept
broader: حکومت محلی