State of disaster
scope note: A condition that may be declared under a State Emergency Services act by the governor or the premier when, on the recommendation of the minister for police and emergency sevices, it appears that a disaster has occurred.
scope note: حالتی که ممکن است به علت بزرگی فاجعه توسط مقام‌های ذیربط اعلام شود و وقوع آن به اطلاع عموم برسد. @fa
related: Disaster
related: Declaration of disaster
preferred label: حالت فاجعه @fa
type: Concept

Disaster
preferred label: فاجعه @fa
type: Concept
related: State of disaster

Declaration of disaster
preferred label: اعلام فاجعه @fa
type: Concept
related: State of disaster