Road accident
alternative label: Motor vehicle accident
scope note: هر سال در جهان در حدود یک میلیون و دویست هزار نفر در تصادفاتی که در راهها و جاده‌ها روی می‌دهد، جان می‌بازند و حدود 50 میلیون نفر مجروح می‌شوند. 70 درصد مرگ و میرها در کشورهای در حال توسعه است. حدود 65 درصد مرگ‌ها به علت تصادف افراد پیاده با وسایل نقلیه موتوری است. هر سال بیش از 10 میلیون نفر به علت تصادفات جاده‌ای فلج یا دچار معلولیت می‌شوند. ایران و هند از نظر حوادث رانندگی در جهان در رده‌های بالا قرار دارند. @fa
related: Bus accident
broader: Accident
preferred label: حادثه جاده‌ای @fa
type: Concept

Bus accident
preferred label: حادثه اتوبوس @fa
type: Concept
related: Road accident

Accident
preferred label: حادثه @fa
type: Concept
narrower: Road accident