اثر گلخانه‌ای
preferred label: Greenhouse effect @en
type: Concept
related: ارزیابی اثر اقلیمی

ارزیابی اثر اقلیمی
preferred label: Climate impact assessment @en
related: بیابانی شدن
related: گرم‌شدن جهانی
related: اثر گلخانه‌ای
related: اقلیم
type: Concept
scope note: ارزیابی آثار تغییراتی که در آب‌وهوای زمین، منطقه‌ای از زمین یا زیرمنطقه آن مشاهده شود و علت آن، فرایندی طبیعی یا عملکرد فعالیت انسان‌ها باشد.
scope note: Change observed in the climate on a global, regional or sub-regional scale caused by natural processes and/or climatic changes. Changes observed in the climate on a global, regional or sub-regional scale caused by natural processes and/or human activity. @en
alternative label: ارزیابی پیامد آب‌وهوایی

بیابانی شدن
preferred label: Desertification @en
type: Concept
related: ارزیابی اثر اقلیمی

گرم‌شدن جهانی
preferred label: Global warming @en
type: Concept
related: ارزیابی اثر اقلیمی

اقلیم
preferred label: Climate @en
type: Concept
related: ارزیابی اثر اقلیمی