مستندسازی تلفات و زخمی‌ها
alternative label: مستندسازی قربانیان
scope note: ثبت و ضبط اطلاعات و طبقه‌بندی قربانیان بر اساس اولویتهای درمانی و نیازهای دارویی و مشخص کردن آنها با علامت‌های لازم مثل رنگ قرمز برای موارد فوری و رنگ سیاه یا سفید برای موارد فوت شده.
broader: تلفات و زخمی‌ها
preferred label: Casualties documentation @en
type: Concept

تلفات و زخمی‌ها
preferred label: Casualties @en
type: Concept
narrower: مستندسازی تلفات و زخمی‌ها