Boat and boating
preferred label: قایق و قایق‌سواری @fa
type: Concept
related: Flood boat

Flood rescue
preferred label: نجات از سیل @fa
type: Concept
related: Flood boat

Flood boat
scope note: Vessels used for rescue, evacuation and resupply purposes.
scope note: قایق‌هایی که برای هدف‌های نجات، تخلیه و انتقال و تجدید تدارکات به‌کار می‌روند. @fa
related: Flood rescue
related: Boat and boating
preferred label: قایق امداد سیل @fa
type: Concept