Urban search and rescue
scope note: An integrated multi-agency response, which is beyond the capability of normal rescue arrangements, to locate, provide initial medical care, and remove entrapped persons from damaged structures and other environments in a safe and expeditious manner.
related: Rescue operations
broader: Search and rescue operations
preferred label: جستجو و نجات شهری @fa
type: Concept

Rescue operations
preferred label: عملیات نجات @fa
type: Concept
related: Urban search and rescue

Search and rescue operations
preferred label: عملیات جستجو و نجات @fa
type: Concept
narrower: Urban search and rescue