نظام اطلاعاتی
preferred label: Information system @en
type: Concept
related: فناوری اطلاعات

فناوری
preferred label: Technology @en
type: Concept
narrower: فناوری اطلاعات

فناوری اطلاعات
alternative label: آی تی
scope note: مجموعه فنون و فعالیت‌هایی که در آنها رایانه و فناوری ارتباطات برای ایجاد، ذخیره‌سازی، پردازش، ارائه، مبادله و مدیریت اطلاعات، مورد استفاده قرار می‌گیرد.
related: نظام اطلاعاتی
broader: فناوری
preferred label: Information technology @en
type: Concept