Risk
preferred label: احتمال خطر @fa
type: Concept
narrower: Residual risk

Residual risk
scope note: The remaining level of risk after risk treatment measures have been taken.
scope note: درجه‌ای از احتمال خطر باقیمانده بعد از اتخاذ اقدامات چاره‌جویانه. @fa
broader: Risk
preferred label: احتمال خطر باقیمانده @fa
type: Concept