Risk
preferred label: احتمال خطر @fa
type: Concept
narrower: Tolerable risk

Tolerable risk
scope note: Risks which the exposed people are expected to bear without undue concern, once all reasonable practicable reduction measures have been adopted.
scope note: احتمال خطر قابل تحمل و تمایل به زندگی توأم با خطر و تأمین پاره‌ای از منابع. @fa
broader: Risk
preferred label: احتمال خطر تحمل‌پذیر @fa
type: Concept