Incident sequence analysis
scope note: The tracing of a primary event forwards in order to define its consequences.
scope note: تجزیه و تحلیل آماری زنجیره‌ای برای کشف این که آیا در مقطعی خاص از یک رویداد، داده‌های کافی برای تعریف نتایج یا فرضیه جمع‌آوری شده است یا ضروری است که داده‌های بیشتر جمع آوری شود. @fa
broader: Incident management
preferred label: تجزیه و تحلیل توالی واقعه @fa
type: Concept

Incident management
preferred label: مدیریت واقعه @fa
type: Concept
narrower: Incident sequence analysis