Incident controller
scope note: The individual responsible for the management of all incident operations.
broader: Incident management
preferred label: کنترل‌کننده واقعه @fa
type: Concept

Incident management
preferred label: مدیریت واقعه @fa
type: Concept
narrower: Incident controller