Registration
scope note: The process of recording details of all people affected by an emergency or disaster whether they are evecuated or remain in the affected area.
scope note: ثبت کردن بیانگر چیزی بیش از گزارش دادن برای اقدام فوری یا فراهم‌آوردن امکان شمارش موارد است. ثبت کردن مستلزم تهیه پرونده دائمی شامل اطلاعات شناسه‌ای است. می‌توان موارد را پیگیری کرد و همچنین برای فراوانی موارد و هم برای بقای آنان می‌توان جدول‌های آماری فراهم ساخت. همچنین فرایند ثبت جزئیات تمام اشخاص متأثر از وضع اضطراری یا فاجعه، خواه تخلیه و منتقل شده باشند و خواه باقی مانده باشند. @fa
narrower: Inquiry system
related: Emergency management
preferred label: ثبت @fa
type: Concept

Inquiry system
preferred label: نظام پرس‌وجو @fa
type: Concept
broader: Registration

Emergency management
preferred label: مدیریت وضع اضطراری @fa
type: Concept
related: Registration