Socio-technological disaster
scope note: Diseasters arising from the interaction between people and technology.
scope note: فاجعه‌های برخاسته از تعامل بین مردم و فناوری که ممکن است همراه با خسارات و تلفات سنگین باشد، مثل آتش‌سوزی اماکن، تأسیسات و منابع، پخش و نشر گازهای شیمیایی و سمی کارخانه‌های مواد شیمیایی، تابش هسته‌ای از تأسیسات و نیروگاهها. @fa
related: Technological disaster
broader: Disaster
preferred label: فاجعه اجتماعی - فناوری @fa
type: Concept

Technological disaster
preferred label: فاجعه ناشی از فناوری @fa
type: Concept
related: Socio-technological disaster

Disaster
preferred label: فاجعه @fa
type: Concept
narrower: Socio-technological disaster