Biological disaster
scope note: Disaster caused by the exposure of living organisms to germs and toxic substances.
scope note: فاجعه‌‌ای که در آن موجودات زنده در معرض میکروب‌ها و مواد سمی قرار می‌گیرند. @fa
broader: Disaster
preferred label: فاجعه زیستی @fa
type: Concept

Disaster
preferred label: فاجعه @fa
type: Concept
narrower: Biological disaster