Bush fire
preferred label: آتش‌سوزی بیشه @fa
type: Concept
narrower: Forest fire

Forest fire
scope note: Fires burning mainly in forest or woodland.
scope note: آتش‌سوزی‌هایی که عمدتاً در جنگل‌ها و مناطق جنگلی رخ می‌دهند و غیر از وارد کردن خسارت‌های مالی و جانی، مشکلات آلودگی هوا را نیز به دنبال دارند. @fa
broader: Bush fire
preferred label: آتش‌سوزی جنگل @fa
type: Concept