Natural disaster
preferred label: فاجعه طبیعی @fa
type: Concept
narrower: Volcano

Volcanology
preferred label: آتشفشان‌شناسی @fa
type: Concept
broader: Volcano

Volcanic ash
preferred label: خاکستر آتشفشانی @fa
type: Concept
related: Volcano

Volcanic eruption
preferred label: فوران آتشفشانی @fa
type: Concept
related: Volcano

Volcanic hazard assessment
preferred label: ارزیابی خطر آتشفشانی @fa
type: Concept
broader: Volcano

Volcano
narrower: Volcanic hazard assessment
narrower: Volcanology
scope note: منفذی در پوسته زمین که از طریق آن، گدازه‌ها به بالا آمده و به سطح زمین می‌رسند و سنگ‌های آذرین و بخار آب و گازها به بیرون پرتاب می‌شوند. آتشفشان‌ها به‌ویژه نزدیک مناطق مسکونی ممکن است باعث تخریب و تعطیل مراکز صنعتی، کشاورزی، فرهنگی، تجاری و تفریحی شوند و خسارت‌های مالی به بار آورند. @fa
scope note: An opening in the crust that has allowed magma to reach the surface.
type: Concept
related: Volcanic ash
related: Volcanic eruption
broader: Natural disaster
preferred label: آتشفشان @fa