آذرخش
preferred label: Lightning @en
type: Concept
related: توفان تندری

توفان تندری
alternative label: توفان توأم با رعد و برق
scope note: Sudden electrical discharges manifested by a flash of light (lightning) and a sharp or rumbling sound (thunder). @en
scope note: توفانی از تگرگ و یا باران که توأم با صدای رعد و درخشش برق در آسمان است.
related: آذرخش
broader: توفان
preferred label: Thunderstorm @en
type: Concept

توفان
preferred label: Storm @en
type: Concept
narrower: توفان تندری