توفان شن
alternative label: ماسه‌باد
scope note: پدیده‌ای در مناطق خشک و یا نیمه خشک که به وسیله بادهای شدید به وجود آمده و ذرات ماسه به وسیله باد از جای برداشته شده و حمل می‌شوند.
broader: توفان
preferred label: Sandstorm @en
type: Concept

توفان
preferred label: Storm @en
type: Concept
narrower: توفان شن