Dust storm
scope note: Dust/sand energetically lifted by strong and turbulent winds.
scope note: گرد و غبار یا شن پرقدرت برخاسته از بادهای شدید و متلاطم. @fa
broader: Storm
preferred label: توفان غبار @fa
type: Concept

Storm
preferred label: توفان @fa
type: Concept
narrower: Dust storm