Functional plan
scope note: Documents describing roles/responsibilities and arrangements for the performance of a key response or recovery function. They are in support of the main plan.
scope note: اسناد تشریح‌کننده نقش‌ها ، مسئولیت‌ها و تدارکات برای انجام واکنش‌‌های کلیدی یا امدادی. این اسناد پشتیبانی‌کننده طرح‌های اصلی هستند. @fa
broader: Emergency management plan
preferred label: برنامه کارکردی @fa
type: Concept

Emergency management plan
preferred label: برنامه مدیریت وضع اضطراری @fa
type: Concept
narrower: Functional plan