Inner perimeter
scope note: That area which is secured to allow effective command, communication and coordination control, and to allow for safe operations while dealing with an emergency, including the immediate ingress and gress needs of emergency response personnel and vehicles.
scope note: منطقه عملیاتی یا محدوده مشخصی که در اطراف صحنه حادثه یا وضع اضطراری، توسط فرماندهان حاضر (مثل پلیس، آتش‌نشانی و اورژانس) ایجاد می‌شود که فقط کارکنان فعال درگیر در وضع اضطراری و وسایل نقلیه مجاز می‌توانند به آن داخل یا خارج شوند تا ارتباطات فرماندهی و هماهنگی به خوبی کنترل و صورت گیرد. @fa
related: Outer perimeter
related: Exclusion area
broader: Emergency management plan
preferred label: محدوده نزدیک به محل حادثه @fa
type: Concept

Outer perimeter
preferred label: محدوده خارج از محل حادثه @fa
type: Concept
related: Inner perimeter

Exclusion area
preferred label: منطقه ممنوعه @fa
type: Concept
related: Inner perimeter

Emergency management plan
preferred label: برنامه مدیریت وضع اضطراری @fa
type: Concept
narrower: Inner perimeter