برنامه واکنش (در مقابل بحران و فاجعه)
alternative label: برنامه مقابله
scope note: برنامه تنظیم شده برای مقابله عاقلانه و منطقی با بحران یا فاجعه و وقایع غیرمنتظره.
broader: برنامه
preferred label: Response plan @en
type: Concept

برنامه
preferred label: Plan @en
type: Concept
narrower: برنامه واکنش (در مقابل بحران و فاجعه)