راهنمای عملیات اضطراری
alternative label: کتاب مبانی عملیات اضطراری
scope note: A document containing specific, step-wise instructions on carrying out emergency operational procedures. @en
scope note: سندی دارای دستورهای هوشمندانه خاص برای پیشبرد عملیات اضطراری.
related: دستورالعمل عملیاتی استاندارد
related: برنامه مدیریت وضع اضطراری
preferred label: Emergency operations manual @en
type: Concept

دستورالعمل عملیاتی استاندارد
preferred label: Standard operating procedure @en
type: Concept
related: راهنمای عملیات اضطراری

برنامه مدیریت وضع اضطراری
preferred label: Emergency management plan @en
type: Concept
related: راهنمای عملیات اضطراری