Health care
preferred label: مراقبت بهداشتی @fa
type: Concept
narrower: Health care facilities

Health care facilities
scope note: Hospitals, nursing homes or other facilities which provide health care services to in-patients, out-patients or day patients.
scope note: بیمارستان‌ها، درمانگاه‌ا، آسایشگاه‌های سالمندان و مانند اینها که خدمات مراقبت پزشکی و بهداشتی ارائه می‌کنند. @fa
broader: Health care
preferred label: تسهیلات مراقبت بهداشتی @fa
type: Concept