Medical care
preferred label: مراقبت پزشکی @fa
type: Concept
related: Health care

Nursing
preferred label: پرستاری @fa
type: Concept
related: Health care

Health care
scope note: The concept concerned with all aspects of providing and distributing health services to a patient population.
scope note: خدمات ارائه شده توسط تشکیلات بهداشتی یا تخصصی برای افراد یا جامعه‌های مختلف به منظور ارتقا، حفظ، نظارت و یا بازگرداندن سلامت. @fa
narrower: Health care facilities
related: Nursing
related: Medical care
preferred label: مراقبت بهداشتی @fa
type: Concept

Health care facilities
preferred label: تسهیلات مراقبت بهداشتی @fa
type: Concept
broader: Health care