Aeronautics
preferred label: هوانوردی @fa
type: Concept
related: Aviation

Aircraft
preferred label: هواپیما @fa
type: Concept
related: Aviation

Aviation
scope note: Art or practice of operating aircraft.
scope note: هنر یا عمل بهره‌برداری از هواپیما یا دانش و فناوری مربوط به پرواز در هوا. @fa
related: Aircraft
related: Aeronautics
preferred label: هواپیمایی @fa
type: Concept