همگن
alternative label: همتراز
scope note: مشخص‌کننده افرادی است که می‌توان آنها را از جهاتی مانند مهارت، سطح آموزشی، موقعیت اجتماعی یا اقتصادی، سن، نژاد و محله برابر دانست.
related: حمایت از همگنان
preferred label: Peer @en
type: Concept

حمایت از همگنان
preferred label: Peer support @en
type: Concept
related: همگن