Evacuation
preferred label: تخلیه و انتقال @fa
type: Concept
related: Relocation

Relocation
scope note: Movement of persons and/or organizations to an alternate area.
related: Evacuation
preferred label: تغییر مکان @fa
type: Concept