بیماری واگیر
preferred label: Communicable disease @en
type: Concept
related: عامل زیستی

عامل
preferred label: Factor @en
type: Concept
narrower: عامل زیستی

عامل زیستی
alternative label: عامل بیولوژیکی
scope note: A micro-organism which causes disease in man, plants, or animals or causes the deterioration of material. @en
scope note: یک میکروارگانیسم که باعث بیماری یا نابودی انسان، گیاه یا حیوان می‌شود.
related: بیماری واگیر
broader: عامل
preferred label: Biological factor @en
type: Concept