ویرانکاری
scope note: رفتار بزهکارانه در جهت تخریب آگاهانه اشیا و اموال عمومی و نابودی آثار هنری و تاریخی.
related: جرم
preferred label: Vandalism @en
type: Concept

جرم
preferred label: Crime @en
type: Concept
related: ویرانکاری