تصویربرداری گرمایی
scope note: شیوه تصویربرداری از اشیاء با استفاده از فروسرخ.
related: دوربین فروسرخ
preferred label: Thermal imaging @en
type: Concept

دوربین فروسرخ
preferred label: Infrared camera @en
type: Concept
related: تصویربرداری گرمایی