Sea surge
scope note: Rises in sea level tha results in the inundation of areas along the coastlines caused by movement of ocean and sea current, winds and major storms.
scope note: پدیده‌ای در دریا که بر اثر برهم‌کنش باد-دریا، جزر و مد، توپوگرافی ساحل و شرایط ایجاد شده توسط انسان روی می‌دهد. @fa
related: Storm surge
preferred label: ضربه آبی دریا @fa
type: Concept

Storm surge
preferred label: خیزاب توفان @fa
type: Concept
related: Sea surge