رابطه صنعتی
preferred label: Industrial relation @en
type: Concept
narrower: رابطه کارگر و کارفرما

رابطه کارگر و کارفرما
scope note: روابط بین کارگران یا اتحادیه‌های کارگری با کارفرمایان که در حقوق یا قوانین کار مشخص می‌شود.
broader: رابطه صنعتی
preferred label: Labor relation @en
type: Concept