شوک
preferred label: shock @en
type: Concept
narrower: شوک ناشی از صدمه

شوک ناشی از صدمه
alternative label: شوک آسیبی
scope note: افراد بشر در طی زندگی در معرض حوادث و وقایع گوناگون اتومبیل، هواپیما، انفجار، آتش‌سوزی، زلزله، و مانند اینها قرار می‌گیرند و اغلب واکنش آنها به صورت شوک تظاهر می‌کند که عبارت است از تغییر زودگذر و عدم موازنه ناپایدار شخصیت.
broader: شوک
preferred label: Traumatic shock @en
type: Concept