گردن‌بند طبی
preferred label: Cervical collar @en
type: Concept
related: تخت روان حمل مصدوم

بی‌حرکت سازی (بیمار)
preferred label: Immobilization (patient) @en
type: Concept
related: تخت روان حمل مصدوم

تخت روان حمل مصدوم
alternative label: تخت تثبیت بیمار
scope note: وسیله‌ای برای نگهداشتن مصدوم در بهترین حالت که ممکن است با چرخ و کمربندهای ایمنی باشد.
related: گردن‌بند طبی
related: بی‌حرکت سازی (بیمار)
preferred label: Spineboard @en
type: Concept