Emergency affected person
scope note: People, other than emergency management personnel, who experience losses or injury or are affected by an emergency. Usually understood to exclude the dead.
scope note: افراد، جز کارکنان مدیریت وضع اضطراری که خسارت‌ها و تلفات و جراحات ناشی از وضع اضطراری را تجربه کنند. @fa
related: Disaster affected person
preferred label: شخص متأثر از وضع اضطراری @fa
type: Concept

Disaster affected person
preferred label: شخص متأثر از فاجعه @fa
type: Concept
related: Emergency affected person