سیل
preferred label: Flood @en
type: Concept
related: تجزیه و تحلیل فراوانی سیل

تجزیه و تحلیل فراوانی سیل
scope note: نمایش گرافیکی ارتباط بین نقطه اوج تخلیه سیلاب و احتمال تجاوز بیش از حد آن.
related: سیل
preferred label: Flood frequency analysis @en
type: Concept