شاهد
scope note: کسی که واجد شرایط و صفات لازم برای شهادت یا گواهی دادن باشد.
related: دلیل و مدرک کارشناس
preferred label: Witness @en
type: Concept

دلیل و مدرک کارشناس
preferred label: Expert evidence @en
type: Concept
related: شاهد